Target
Platelet-activating factor acetylhydrolase
Ligand
BDBM50093913
Substrate
Meas. Tech.
ChEBML_156211
IC50
0.400000±n/a nM
Citation
 Bloomer, JCBoyd, HFHickey, DMIfe, RJLeach, CAMacphee, CHMilliner, KJPinto, ILRawlings, DASmith, SAStansfield, IGStanway, SJTaylor, MATheobald, CJWhittaker, CM 1-(Arylpiperazinylamidoalkyl)-pyrimidones: orally active inhibitors of lipoprotein-associated phospholipase A(2). Bioorg Med Chem Lett 11:1925-9 (2001)  
Target
Name:
Platelet-activating factor acetylhydrolase
Synonyms:
1-alkyl-2-acetylglycerophosphocholine esterase LDL-PLA(2) PAF 2-acylhydrolase PAFAH PLA2G7 | Platelet-activating factor acetylhydrolase
Type:
PROTEIN
Mol. Mass.:
50084.41
Organism:
Homo sapiens (Human)
Description:
ChEMBL_156212
Residue:
441
  
Inhibitor
Name:
BDBM50093913
Synonyms:
4-[2-(4-Fluoro-benzylsulfanyl)-4-oxo-5-pyrimidin-5-ylmethyl-4H-pyrimidin-1-yl]-N-((E)-octadec-9-enyl)-butyramide | CHEMBL293933
Type:
Small organic molecule
Emp. Form.:
C38H54FN5O2S
Mol. Mass.:
663.931
SMILES:
CCCCCCCC\C=C\CCCCCCCCNC(=O)CCCn1cc(Cc2cncnc2)c(=O)nc1SCc1ccc(F)cc1
: