Target
Proto-oncogene tyrosine-protein kinase Src
Ligand
BDBM50103048
Substrate
Meas. Tech.
ChEMBL_202785 (CHEMBL808039)
IC50
1000±n/a nM
Citation
 Lesuisse, DDeprez, PAlbert, EDuc, TTSortais, BGofflo, DJean-Baptiste, VMarquette, JSchoot, BSarubbi, ELange, GBroto, PMandine, E Discovery of thioazepinone ligands for Src SH2: from non-specific to specific binding. Bioorg Med Chem Lett 11:2127-31 (2001)  
Target
Name:
Proto-oncogene tyrosine-protein kinase Src
Synonyms:
Calmodulin/Proto-oncogene tyrosine-protein kinase Src Proto-oncogene c-Src SRC SRC_HUMAN V-src sarcoma (Schmidt-Ruppin A-2) viral oncogene homolog (avian) p60-Src | pp60c-src
Type:
Protein
Mol. Mass.:
59838.60
Organism:
Homo sapiens (Human)
Description:
P12931
Residue:
536
  
Inhibitor
Name:
BDBM50103048
Synonyms:
CHEMBL67529 | [(S)-1-[5-(3-Cyclohexyl-propyl)-4-oxo-2,3,4,5-tetrahydro-benzo[b][1,4]thiazepin-3-ylcarbamoyl]-2-(4-phosphonooxy-phenyl)-ethyl]-carbamic acid tert-butyl ester
Type:
Small organic molecule
Emp. Form.:
C32H44N3O8PS
Mol. Mass.:
661.746
SMILES:
CC(C)(C)OC(=O)N[C@@H](Cc1ccc(OP(O)(O)=O)cc1)C(=O)NC1CSc2ccccc2N(CCCC2CCCCC2)C1=O
: