Target
Endothelin-1 receptor
Ligand
BDBM50104992
Substrate
Meas. Tech.
ChEMBL_65802 (CHEMBL679705)
IC50
0.051±n/a nM
Citation
 Morimoto, HShimadzu, HKushiyama, EKawanishi, HHosaka, TKawase, YYasuda, KKikkawa, KYamauchi-Kohno, RYamada, K Potent and selective ET-A antagonists. 1. Syntheses and structure-activity relationships of N-(6-(2-(aryloxy)ethoxy)-4-pyrimidinyl)sulfonamide derivatives. J Med Chem 44:3355-68 (2001)  
Target
Name:
Endothelin-1 receptor
Synonyms:
EDNRA Endothelin receptor ET-A
Type:
PROTEIN
Mol. Mass.:
48707.29
Organism:
Sus scrofa
Description:
ChEMBL_65803
Residue:
427
  
Inhibitor
Name:
BDBM50104992
Synonyms:
CHEMBL114700 | N-[6-[2-(5-Bromo-pyrimidin-2-yloxy)-ethoxy]-5-(3-methoxy-phenoxy)-pyrimidin-4-yl]-4-tert-butyl-benzenesulfonamide
Type:
Small organic molecule
Emp. Form.:
C27H28BrN5O6S
Mol. Mass.:
630.51
SMILES:
COc1cccc(Oc2c(NS(=O)(=O)c3ccc(cc3)C(C)(C)C)ncnc2OCCOc2ncc(Br)cn2)c1
: