Target
E-selectin
Ligand
BDBM50105172
Substrate
Meas. Tech.
ChEMBL_199699 (CHEMBL802927)
IC50
5±n/a nM
Citation
 Zhu, GDArendsen, DLGunawardana, IWBoyd, SAStewart, AOFry, DGCool, BLKifle, LSchaefer, VMeuth, JMarsh, KCKempf-Grote, AJKilgannon, PGallatin, WMOkasinski, GF Selective inhibition of ICAM-1 and E-selectin expression in human endothelial cells. 2. Aryl modifications of 4-(aryloxy)thieno[2,3-c]pyridines with fine-tuning at C-2 carbamides. J Med Chem 44:3469-87 (2001)  
Target
Name:
E-selectin
Synonyms:
ELAM1 SELE Selectin E
Type:
PROTEIN
Mol. Mass.:
66642.96
Organism:
Homo sapiens (Human)
Description:
ChEMBL_1438995
Residue:
610
  
Inhibitor
Name:
BDBM50105172
Synonyms:
4-[4-(2-Methoxy-ethoxymethyl)-phenoxy]-thieno[2,3-c]pyridine-2-carboxylic acid amide | CHEMBL117668
Type:
Small organic molecule
Emp. Form.:
C18H18N2O4S
Mol. Mass.:
358.412
SMILES:
COCCOCc1ccc(Oc2cncc3sc(cc23)C(N)=O)cc1
: