Target
Apolipoprotein B-100
Ligand
BDBM50107781
Substrate
Meas. Tech.
ChEMBL_217986 (CHEMBL824105)
IC50
2.5±n/a nM
Citation
 Ksander, GMdeJesus, RYuan, AFink, CMoskal, MCarlson, EKukkola, PBilci, NWallace, ENeubert, AFeldman, DMogelesky, TPoirier, KJeune, MSteele, RWasvery, JStephan, ZCahill, EWebb, RNavarrete, ALee, WGibson, JAlexander, NSharif, HHospattankar, A Diaminoindanes as microsomal triglyceride transfer protein inhibitors. J Med Chem 44:4677-87 (2001)  
Target
Name:
Apolipoprotein B-100
Synonyms:
APOB Apo B-100 Apolipoprotein B-100 | Apolipoprotein B-48
Type:
PROTEIN
Mol. Mass.:
515630.53
Organism:
Homo sapiens (Human)
Description:
ChEMBL_217986
Residue:
4563
  
Inhibitor
Name:
BDBM50107781
Synonyms:
6,4'-Dimethyl-biphenyl-2-carboxylic acid (2-benzenesulfonylamino-indan-5-yl)-amide | CHEMBL344439
Type:
Small organic molecule
Emp. Form.:
C30H28N2O3S
Mol. Mass.:
496.62
SMILES:
Cc1ccc(cc1)-c1c(C)cccc1C(=O)Nc1ccc2CC(Cc2c1)NS(=O)(=O)c1ccccc1
: