Target
Cytosolic phospholipase A2 beta
Ligand
BDBM50110852
Substrate
Meas. Tech.
ChEMBL_156210 (CHEMBL767152)
IC50
2300±n/a nM
Citation
 Connolly, SBennion, CBotterell, SCroshaw, PJHallam, CHardy, KHartopp, PJackson, CGKing, SJLawrence, LMete, AMurray, DRobinson, DHSmith, GMStein, LWalters, IWells, EWithnall, WJ Design and synthesis of a novel and potent series of inhibitors of cytosolic phospholipase A(2) based on a 1,3-disubstituted propan-2-one skeleton. J Med Chem 45:1348-62 (2002)  
Target
Name:
Cytosolic phospholipase A2 beta
Synonyms:
Cytosolic phospholipase A2 beta PLA2G4B Phospholipase A2 group IVB | cPLA2-beta
Type:
PROTEIN
Mol. Mass.:
87967.69
Organism:
Homo sapiens (Human)
Description:
ChEMBL_156210
Residue:
781
  
Inhibitor
Name:
BDBM50110852
Synonyms:
3-{3-[4-(Naphthalen-2-ylmethoxy)-phenoxy]-2-oxo-propylsulfanyl}-propionic acid | CHEMBL29674
Type:
Small organic molecule
Emp. Form.:
C23H22O5S
Mol. Mass.:
410.483
SMILES:
OC(=O)CCSCC(=O)COc1ccc(OCc2ccc3ccccc3c2)cc1
: