Target
Neuropeptide Y receptor type 5
Ligand
BDBM50111647
Substrate
Meas. Tech.
ChEMBL_143995 (CHEMBL750833)
IC50
1.5±n/a nM
Citation
 Tabuchi, SItani, HSakata, YOohashi, HSatoh, Y Novel potent antagonists of human neuropeptide Y Y5 receptor. Part 1: 2-oxobenzothiazolin-3-acetic acid derivatives. Bioorg Med Chem Lett 12:1171-5 (2002)  
Target
Name:
Neuropeptide Y receptor type 5
Synonyms:
NPY-Y5 NPY5-R NPY5R_HUMAN NPYY5 Neuropeptide Y receptor type 5 ( NPY Y5) | Y5 receptor
Type:
Enzyme
Mol. Mass.:
50746.64
Organism:
Homo sapiens (Human)
Description:
Q15761
Residue:
445
  
Inhibitor
Name:
BDBM50111647
Synonyms:
1-[2-(5-Chloro-2-oxo-benzothiazol-3-yl)-acetyl]-piperidine-4-carboxylic acid (4-phenoxy-phenyl)-amide | CHEMBL279309
Type:
Small organic molecule
Emp. Form.:
C27H24ClN3O4S
Mol. Mass.:
522.015
SMILES:
Clc1ccc2sc(=O)n(CC(=O)N3CCC(CC3)C(=O)Nc3ccc(Oc4ccccc4)cc3)c2c1
: