Target
Histamine H3 receptor
Ligand
BDBM50112016
Substrate
Meas. Tech.
ChEBML_85849
Ki
25±n/a nM
Citation
 Aslanian, RMutahi, MWShih, NYMcCormick, KDPiwinski, JJTing, PCAlbanese, MMBerlin, MYZhu, XWong, SCRosenblum, SBJiang, YWest, RShe, SWilliams, SMBryant, MHey, JA Identification of a novel, orally bioavailable histamine H(3) receptor antagonist based on the 4-benzyl-(1H-imidazol-4-yl) template. Bioorg Med Chem Lett 12:937-41 (2002)  
Target
Name:
Histamine H3 receptor
Synonyms:
HISTAMINE H3 HRH3_CAVPO | Histamine H3 receptor
Type:
Enzyme Catalytic Domain
Mol. Mass.:
48753.61
Organism:
GUINEA PIG
Description:
HISTAMINE H3 HRH3 GUINEA PIG::Q9JI35
Residue:
445
  
Inhibitor
Name:
BDBM50112016
Synonyms:
(4-Chloro-phenyl)-carbamic acid 4-(1H-imidazol-4-ylmethyl)-benzyl ester | CHEMBL173585
Type:
Small organic molecule
Emp. Form.:
C18H16ClN3O2
Mol. Mass.:
341.792
SMILES:
Clc1ccc(NC(=O)OCc2ccc(Cc3cnc[nH]3)cc2)cc1
: