Target
Coagulation factor X
Ligand
BDBM50112491
Substrate
Meas. Tech.
ChEBML_49302
Ki
0.100000±n/a nM
Citation
 Wu, SGuilford, WJChou, YLGriedel, BDLiang, ASakata, SShaw, KJTrinh, LXu, WZhao, ZMorrissey, MM Design and synthesis of aminophenol-based factor Xa inhibitors. Bioorg Med Chem Lett 12:1307-10 (2002)  
Target
Name:
Coagulation factor X
Synonyms:
Activated coagulation factor X (FXa) Coagulation factor X precursor F10 Factor X heavy chain Factor Xa Stuart-Prower factor
Type:
Enzyme
Mol. Mass.:
54726.60
Organism:
Homo sapiens (Human)
Description:
Residue:
488
  
Inhibitor
Name:
BDBM50112491
Synonyms:
4-Hydroxy-3-(3-{4-[1-(1-imino-ethyl)-piperidin-4-yloxy]-3-trifluoromethyl-phenylamino}-propenyl)-benzamidine | CHEMBL423656
Type:
Small organic molecule
Emp. Form.:
C24H28F3N5O2
Mol. Mass.:
475.5066
SMILES:
CC(=N)N1CCC(CC1)Oc1ccc(NCC=Cc2cc(ccc2O)C(N)=N)cc1C(F)(F)F
: