Target
Proto-oncogene tyrosine-protein kinase Src
Ligand
BDBM14694
Substrate
Meas. Tech.
ChEMBL_202779 (CHEMBL873263)
IC50
450±n/a nM
Citation
 Lesuisse, DLange, GDeprez, PBénard, DSchoot, BDelettre, GMarquette, JPBroto, PJean-Baptiste, VBichet, PSarubbi, EMandine, E SAR and X-ray. A new approach combining fragment-based screening and rational drug design: application to the discovery of nanomolar inhibitors of Src SH2. J Med Chem 45:2379-87 (2002)  
Target
Name:
Proto-oncogene tyrosine-protein kinase Src
Synonyms:
Calmodulin/Proto-oncogene tyrosine-protein kinase Src Proto-oncogene c-Src SRC SRC_HUMAN V-src sarcoma (Schmidt-Ruppin A-2) viral oncogene homolog (avian) p60-Src | pp60c-src
Type:
Protein
Mol. Mass.:
59838.60
Organism:
Homo sapiens (Human)
Description:
P12931
Residue:
536
  
Inhibitor
Name:
BDBM14694
Synonyms:
2-(carboxymethyl)-5-[(2S)-2-acetamido-2-{[(3S)-2-oxo-1-[(4-phenylphenyl)methyl]azepan-3-yl]carbamoyl}ethyl]benzoic acid CHEMBL432359 RU85053
Type:
Small organic molecule
Emp. Form.:
C33H35N3O7
Mol. Mass.:
585.6469
SMILES:
CC(=O)N[C@@H](Cc1ccc(CC(O)=O)c(c1)C(O)=O)C(=O)N[C@H]1CCCCN(Cc2ccc(cc2)-c2ccccc2)C1=O
: