Target
Adenosine receptor A3
Ligand
BDBM50116374
Substrate
Meas. Tech.
ChEMBL_31694 (CHEMBL876574)
Ki
210±n/a nM
Citation
 Priego, EMvon Frijtag Drabbe Kuenzel, JIJzerman, APCamarasa, MJPérez-Pérez, MJ Pyrido[2,1-f]purine-2,4-dione derivatives as a novel class of highly potent human A(3) adenosine receptor antagonists. J Med Chem 45:3337-44 (2002)  
Target
Name:
Adenosine receptor A3
Synonyms:
A3 adenosine receptor (hA3) ADORA3 | Adenosine A3 receptor (A3AR)
Type:
G Protein-Coupled Receptor (GPCR)
Mol. Mass.:
36197.32
Organism:
Homo sapiens (Human)
Description:
P0DMS8
Residue:
318
  
Inhibitor
Name:
BDBM50116374
Synonyms:
1-Benzyl-7-methoxy-1H-1,3,4b,9-tetraaza-fluorene-2,4-dione | CHEMBL322968
Type:
Small organic molecule
Emp. Form.:
C17H14N4O3
Mol. Mass.:
322.3181
SMILES:
COc1ccn2c(c1)nc1n(Cc3ccccc3)c(=O)[nH]c(=O)c21
: