Target
Glutathionylspermidine synthase
Ligand
BDBM50117542
Substrate
Meas. Tech.
ChEMBL_72740 (CHEMBL681927)
IC50
3200±n/a nM
Citation
 Amssoms, KOza, SLRavaschino, EYamani, ALambeir, ARajan, PBal, GRodriguez, JFairlamb, AHAugustyns, KHaemers, A Glutathione-like tripeptides as inhibitors of glutathionylspermidine synthetase. Part 1: Substitution of the glycine carboxylic acid group. Bioorg Med Chem Lett 12:2553-6 (2002)  
Target
Name:
Glutathionylspermidine synthase
Synonyms:
GSP | GSP_CRIFA
Type:
PROTEIN
Mol. Mass.:
80299.94
Organism:
Crithidia fasciculata
Description:
ChEMBL_72759
Residue:
719
  
Inhibitor
Name:
BDBM50117542
Synonyms:
2-Amino-4-[1-(hydroxycarbamoylmethyl-carbamoyl)-3-methyl-butylcarbamoyl]-butyric acid | CHEMBL83240
Type:
Small organic molecule
Emp. Form.:
C13H24N4O6
Mol. Mass.:
332.3529
SMILES:
CC(C)C[C@H](NC(=O)CC[C@H](N)C(O)=O)C(=O)NCC(=O)NO
: