Target
Sodium-dependent serotonin transporter
Ligand
BDBM50118294
Substrate
Meas. Tech.
ChEMBL_201484 (CHEMBL805241)
Ki
5.5±n/a nM
Citation
 Houlihan, WJAhmad, UFKoletar, JKelly, LBrand, LKopajtic, TA Benzo- and cyclohexanomazindol analogues as potential inhibitors of the cocaine binding site at the dopamine transporter. J Med Chem 45:4110-8 (2002)  
Target
Name:
Sodium-dependent serotonin transporter
Synonyms:
5-HT Transporter 5HTT SC6A4_HUMAN SLC6A4 Serotonin transporter (5HTT) Sodium-dependent serotonin transporter (SERT) | Solute carrier family 6 member 4
Type:
Multi-pass membrane protein
Mol. Mass.:
70322.51
Organism:
Homo sapiens (Human)
Description:
P31645
Residue:
630
  
Inhibitor
Name:
BDBM50118294
Synonyms:
7-(4-Chloro-phenyl)-7,8,9,10-tetrahydro-7a,11-diaza-benzo[c]fluoren-7-ol | CHEMBL334577
Type:
Small organic molecule
Emp. Form.:
C21H17ClN2O
Mol. Mass.:
348.825
SMILES:
OC1(N2CCCN=C2c2c1ccc1ccccc21)c1ccc(Cl)cc1
: