Target
Histamine H2 receptor
Ligand
BDBM50119708
Substrate
Meas. Tech.
ChEBML_85525
Ki
710±n/a nM
Citation
 Vasudevan, AConner, SEGentles, RGFaghih, RLiu, HDwight, WIreland, LKang, CHEsbenshade, TABennani, YLHancock, AA Synthesis and evaluation of potent pyrrolidine H(3) antagonists. Bioorg Med Chem Lett 12:3055-8 (2002)  
Target
Name:
Histamine H2 receptor
Synonyms:
Gastric receptor I HISTAMINE H2 HRH2_HUMAN Histamine H2-Gs alpha S
Type:
G Protein-Coupled Receptor (GPCR)
Mol. Mass.:
40115.31
Organism:
Homo sapiens (Human)
Description:
Residue:
359
  
Inhibitor
Name:
BDBM50119708
Synonyms:
2-Cyano-N-{(S)-1-[3-(4-cyclopropanecarbonyl-phenoxy)-propyl]-pyrrolidin-3-yl}-benzenesulfonamide | CHEMBL420108
Type:
Small organic molecule
Emp. Form.:
C24H27N3O4S
Mol. Mass.:
453.554
SMILES:
O=C(C1CC1)c1ccc(OCCCN2CC[C@@H](C2)NS(=O)(=O)c2ccccc2C#N)cc1
: