Target
Procathepsin L
Ligand
BDBM50121903
Substrate
Meas. Tech.
ChEBML_48362
IC50
15±n/a nM
Citation
 Zhou, NEGuo, DThomas, GReddy, AVKaleta, JPurisima, EMenard, RMicetich, RGSingh, R 3-Acylamino-azetidin-2-one as a novel class of cysteine proteases inhibitors. Bioorg Med Chem Lett 13:139-41 (2002)  
Target
Name:
Procathepsin L
Synonyms:
CATL1_HUMAN CTSL CTSL1 Cathepsin L Cathepsin L1 heavy chain MEP cathepsin L preproprotein
Type:
Enzyme
Mol. Mass.:
37557.19
Organism:
Homo sapiens (Human)
Description:
Purchased from Calbiochem (San Diego, CA).
Residue:
333
  
Inhibitor
Name:
BDBM50121903
Synonyms:
CHEMBL31272 | [(S)-1-((3R,4R)-2-Oxo-4-phenylsulfanyl-azetidin-3-ylcarbamoyl)-2-phenyl-ethyl]-carbamic acid benzyl ester
Type:
Small organic molecule
Emp. Form.:
C26H25N3O4S
Mol. Mass.:
475.559
SMILES:
O=C(N[C@@H](Cc1ccccc1)C(=O)N[C@H]1[C@H](NC1=O)Sc1ccccc1)OCc1ccccc1
: