Target
Platelet-activating factor receptor
Ligand
BDBM50123639
Substrate
Meas. Tech.
ChEMBL_155145 (CHEMBL760186)
Ki
110±n/a nM
Citation
 Vogensen, SBStrømgaard, KShindou, HJaracz, SSuehiro, MIshii, SShimizu, TNakanishi, K Preparation of 7-substituted ginkgolide derivatives: potent platelet activating factor (PAF) receptor antagonists. J Med Chem 46:601-8 (2003)  
Target
Name:
Platelet-activating factor receptor
Synonyms:
PAF-R PTAFR_CAVPO Platelet-activating factor receptor
Type:
Protein
Mol. Mass.:
39005.63
Organism:
Cavia porcellus
Description:
Residue:
342
  
Inhibitor
Name:
BDBM50123639
Synonyms:
8-(tert-butyl)-9-chloro-6,12,17-trihydroxy-16-methyl-(6R,8R,9R,12R,16S,17R)-2,4,14,19-tetraoxahexacyclo[8.7.2.01,11.03,7.07,11.013,17]nonadecane-5,15,18-trione | CHEMBL422003
Type:
Small organic molecule
Emp. Form.:
C20H23ClO10
Mol. Mass.:
458.844
SMILES:
C[C@@H]1C(=O)OC2[C@H](O)C34C5OC(=O)C3(OC3OC(=O)[C@H](O)C43C([C@H]5Cl)C(C)(C)C)[C@@]12O
: