Target
Calpain small subunit 1
Ligand
BDBM50124029
Substrate
Meas. Tech.
ChEBML_43863
Ki
80±n/a nM
Citation
 Donkor, IOKorukonda, RHuang, TLLeCour, L Peptidyl aldehyde inhibitors of calpain incorporating P2-proline mimetics. Bioorg Med Chem Lett 13:783-4 (2003)  
Target
Name:
Calpain small subunit 1
Synonyms:
CANP small subunit CAPNS1 CPNS1_PIG Calcium-activated neutral proteinase small subunit Calcium-dependent protease small subunit 1 | Calpain regulatory subunit
Type:
PROTEIN
Mol. Mass.:
28062.13
Organism:
Sus scrofa
Description:
ChEMBL_43862
Residue:
266
  
Inhibitor
Name:
BDBM50124029
Synonyms:
1-(Toluene-4-sulfonyl)-pyrrolidine-2-carboxylic acid (1-benzyl-2-oxo-ethyl)-amide | CHEMBL446429
Type:
Small organic molecule
Emp. Form.:
C21H24N2O4S
Mol. Mass.:
400.491
SMILES:
Cc1ccc(cc1)S(=O)(=O)N1CCCC1C(=O)NC(Cc1ccccc1)C=O
: