Target
Melanocyte-stimulating hormone receptor
Ligand
BDBM50451759
Substrate
Meas. Tech.
ChEMBL_105836 (CHEMBL716495)
IC50
250±n/a nM
Citation
 Danho, WSwistok, JCheung, AWKurylko, GFranco, LChu, XJChen, LYagaloff, K Structure-activity relationship of linear peptide Bu-His6-DPhe7-Arg8-Trp9-Gly10-NH2 at the human melanocortin-1 and -4 receptors: DPhe7 and Trp9 substitution. Bioorg Med Chem Lett 13:649-52 (2003)  
Target
Name:
Melanocyte-stimulating hormone receptor
Synonyms:
MC1-R MSH-R MSHR_HUMAN Melanocortin receptor (M1 and M4) Melanocortin receptor 1 (MC1-R) | Melanocortin receptor 1 (MC1R)
Type:
Enzyme
Mol. Mass.:
34717.23
Organism:
Homo sapiens (Human)
Description:
Q01726
Residue:
317
  
Inhibitor
Name:
BDBM50451759
Synonyms:
CHEMBL2371219
Type:
Small organic molecule
Emp. Form.:
C38H48Cl2N12O6
Mol. Mass.:
839.771
SMILES:
CCCC(=O)N[C@@H](Cc1c[nH]cn1)C(=O)N[C@H](Cc1ccc(Cl)c(Cl)c1)C(=O)N[C@@H](CCCN=C(N)N)C(=O)N[C@@H](Cc1c[nH]c2ccccc12)C(=O)NCC(N)=O
: