Target
Melanocyte-stimulating hormone receptor
Ligand
BDBM50124775
Substrate
Meas. Tech.
ChEBML_105836
EC50
0.400000±n/a nM
Citation
 Danho, WSwistok, JCheung, AWKurylko, GFranco, LChu, XJChen, LYagaloff, K Structure-activity relationship of linear peptide Bu-His6-DPhe7-Arg8-Trp9-Gly10-NH2 at the human melanocortin-1 and -4 receptors: DPhe7 and Trp9 substitution. Bioorg Med Chem Lett 13:649-52 (2003)  
Target
Name:
Melanocyte-stimulating hormone receptor
Synonyms:
MC1-R MSH-R MSHR_HUMAN Melanocortin receptor (M1 and M4) Melanocortin receptor 1 (MC1-R) | Melanocortin receptor 1 (MC1R)
Type:
Enzyme
Mol. Mass.:
34717.23
Organism:
Homo sapiens (Human)
Description:
Q01726
Residue:
317
  
Inhibitor
Name:
BDBM50124775
Synonyms:
(S)-2-[(S)-2-[(S)-2-Butyrylamino-3-(3H-imidazol-4-yl)-propionylamino]-3-(4-methoxy-phenyl)-propionylamino]-5-guanidino-pentanoic acid [(S)-1-(carbamoylmethyl-carbamoyl)-2-(1H-indol-3-yl)-ethyl]-amide | CHEMBL345234
Type:
Small organic molecule
Emp. Form.:
C39H52N12O7
Mol. Mass.:
800.9064
SMILES:
CCCC(=O)N[C@@H](Cc1cnc[nH]1)C(=O)N[C@@H](Cc1ccc(OC)cc1)C(=O)N[C@@H](CCCNC(N)=N)C(=O)N[C@@H](Cc1c[nH]c2ccccc12)C(=O)NCC(N)=O
: