Target
Platelet-activating factor acetylhydrolase
Ligand
BDBM50125266
Substrate
Meas. Tech.
ChEBML_101008
IC50
0.100000±n/a nM
Citation
 Blackie, JABloomer, JCBrown, MJCheng, HYHammond, BHickey, DMIfe, RJLeach, CALewis, VAMacphee, CHMilliner, KJMoores, KEPinto, ILSmith, SAStansfield, IGStanway, SJTaylor, MATheobald, CJ The identification of clinical candidate SB-480848: a potent inhibitor of lipoprotein-associated phospholipase A2. Bioorg Med Chem Lett 13:1067-70 (2003)  
Target
Name:
Platelet-activating factor acetylhydrolase
Synonyms:
1-alkyl-2-acetylglycerophosphocholine esterase LDL-PLA(2) PAF 2-acylhydrolase PAFAH PLA2G7 | Platelet-activating factor acetylhydrolase
Type:
PROTEIN
Mol. Mass.:
50084.41
Organism:
Homo sapiens (Human)
Description:
ChEMBL_156212
Residue:
441
  
Inhibitor
Name:
BDBM50125266
Synonyms:
CHEMBL10441 | N-(2-Diethylamino-ethyl)-2-[2-(4-fluoro-benzylsulfanyl)-4-oxo-5,6,7,8-tetrahydro-4H-quinazolin-1-yl]-N-(4'-trifluoromethyl-biphenyl-4-ylmethyl)-acetamide
Type:
Small organic molecule
Emp. Form.:
C37H40F4N4O2S
Mol. Mass.:
680.798
SMILES:
CCN(CC)CCN(Cc1ccc(cc1)-c1ccc(cc1)C(F)(F)F)C(=O)Cn1c(SCc2ccc(F)cc2)nc(=O)c2CCCCc12
: