Target
Receptor tyrosine-protein kinase erbB-2
Ligand
BDBM50126732
Substrate
Meas. Tech.
ChEMBL_161605 (CHEMBL769145)
IC50
>10000±n/a nM
Citation
 Goldberg, DRButz, TCardozo, MGEckner, RJHammach, AHuang, JJakes, SKapadia, SKashem, MLukas, SMorwick, TMPanzenbeck, MPatel, UPav, SPeet, GWPeterson, JDProkopowicz, ASSnow, RJSellati, RTakahashi, HTan, JTschantz, MAWang, XJWang, YWolak, JXiong, PMoss, N Optimization of 2-phenylaminoimidazo[4,5-h]isoquinolin-9-ones: orally active inhibitors of lck kinase. J Med Chem 46:1337-49 (2003)  
Target
Name:
Receptor tyrosine-protein kinase erbB-2
Synonyms:
2.7.10.1 CD_antigen=CD340 ERBB2_HUMAN FASN/HER2 HER2 MLN19 NEU Proto-oncogene Neu Tyrosine kinase-type cell surface receptor HER2 | p185erbB2
Type:
Mol. Mass.:
137894.47
Organism:
Homo sapiens (Human)
Description:
P04626
Residue:
1255
  
Inhibitor
Name:
BDBM50126732
Synonyms:
2-(2,6-Dichloro-phenylamino)-7-(3-diethylamino-propenyl)-1,6-dimethyl-1,8-dihydro-imidazo[4,5-h]isoquinolin-9-one | CHEMBL281957
Type:
Small organic molecule
Emp. Form.:
C25H27Cl2N5O
Mol. Mass.:
484.421
SMILES:
CCN(CC)CC=Cc1[nH]c(=O)c2c3n(C)c(Nc4c(Cl)cccc4Cl)nc3ccc2c1C
: