Target
Plasminogen activator inhibitor 1
Ligand
BDBM50132853
Substrate
Meas. Tech.
ChEMBL_155612 (CHEMBL766347)
IC50
100±n/a nM
Citation
 Ye, BBauer, SBuckman, BOGhannam, AGriedel, BDKhim, SKLee, WSacchi, KLShaw, KJLiang, AWu, QZhao, Z Synthesis and biological evaluation of menthol-based derivatives as inhibitors of plasminogen activator inhibitor-1 (PAI-1). Bioorg Med Chem Lett 13:3361-5 (2003)  
Target
Name:
Plasminogen activator inhibitor 1
Synonyms:
Endothelial plasminogen activator inhibitor PAI-1 PAI1_HUMAN Plasminogen activator inhibitor 1 Plasminogen activator inhibitor-1 SERPINE1
Type:
Enzyme
Mol. Mass.:
45064.00
Organism:
Homo sapiens (Human)
Description:
P05121
Residue:
402
  
Inhibitor
Name:
BDBM50132853
Synonyms:
3-{3-[2-((1R,2S,5R)-2-Isopropyl-5-methyl-cyclohexyloxy)-acetylamino]-4-nitro-phenoxy}-benzoic acid | CHEMBL114144
Type:
Small organic molecule
Emp. Form.:
C25H30N2O7
Mol. Mass.:
470.5149
SMILES:
CC(C)[C@@H]1CC[C@@H](C)C[C@H]1OCC(=O)Nc1cc(Oc2cccc(c2)C(O)=O)ccc1[N+]([O-])=O
: