Target
Holo-[acyl-carrier-protein] synthase
Ligand
BDBM50137242
Substrate
Meas. Tech.
ChEBML_88040
IC50
830.0±n/a nM
Citation
 Gilbert, AMKirisits, MToy, PNunn, DSFailli, ADushin, EGNovikova, EPetersen, PJJoseph-McCarthy, DMcFadyen, IFritz, CC Anthranilate 4H-oxazol-5-ones: novel small molecule antibacterial acyl carrier protein synthase (AcpS) inhibitors. Bioorg Med Chem Lett 14:37-41 (2003)  
Target
Name:
Holo-[acyl-carrier-protein] synthase
Synonyms:
ACPS_BACSU acpS | ydcB
Type:
PROTEIN
Mol. Mass.:
13724.66
Organism:
Bacillus subtilis
Description:
ChEMBL_326222
Residue:
121
  
Inhibitor
Name:
BDBM50137242
Synonyms:
5-Methyl-2-{[5-oxo-2-(4-trifluoromethyl-phenyl)-oxazol-(4E)-ylidenemethyl]-amino}-benzoic acid | CHEMBL130683
Type:
Small organic molecule
Emp. Form.:
C19H13F3N2O4
Mol. Mass.:
390.3127
SMILES:
Cc1ccc(\N=C\c2nc(oc2O)-c2ccc(cc2)C(F)(F)F)c(c1)C(O)=O
: