Target
Holo-[acyl-carrier-protein] synthase
Ligand
BDBM50137243
Substrate
Meas. Tech.
ChEBML_88040
IC50
>20000±n/a nM
Citation
 Gilbert, AMKirisits, MToy, PNunn, DSFailli, ADushin, EGNovikova, EPetersen, PJJoseph-McCarthy, DMcFadyen, IFritz, CC Anthranilate 4H-oxazol-5-ones: novel small molecule antibacterial acyl carrier protein synthase (AcpS) inhibitors. Bioorg Med Chem Lett 14:37-41 (2003)  
Target
Name:
Holo-[acyl-carrier-protein] synthase
Synonyms:
ACPS_BACSU acpS | ydcB
Type:
PROTEIN
Mol. Mass.:
13724.66
Organism:
Bacillus subtilis
Description:
ChEMBL_326222
Residue:
121
  
Inhibitor
Name:
BDBM50137243
Synonyms:
2-{[5-Oxo-2-phenyl-oxazol-(4E)-ylidenemethyl]-amino}-benzoic acid | CHEMBL134062
Type:
Small organic molecule
Emp. Form.:
C17H12N2O4
Mol. Mass.:
308.2882
SMILES:
OC(=O)c1ccccc1\N=C\c1nc(oc1O)-c1ccccc1
: