Target
Plasminogen activator inhibitor 1
Ligand
BDBM50139534
Substrate
Meas. Tech.
ChEBML_155740
IC50
500±n/a nM
Citation
 Ye, BChou, YLKaranjawala, RLee, WLu, SFShaw, KJJones, SLentz, DLiang, ATseng, JLWu, QZhao, Z Synthesis and biological evaluation of piperazine-based derivatives as inhibitors of plasminogen activator inhibitor-1 (PAI-1). Bioorg Med Chem Lett 14:761-5 (2004)  
Target
Name:
Plasminogen activator inhibitor 1
Synonyms:
Endothelial plasminogen activator inhibitor PAI-1 PAI1_HUMAN Plasminogen activator inhibitor 1 Plasminogen activator inhibitor-1 SERPINE1
Type:
Enzyme
Mol. Mass.:
45064.00
Organism:
Homo sapiens (Human)
Description:
P05121
Residue:
402
  
Inhibitor
Name:
BDBM50139534
Synonyms:
2-[2-Methoxy-6-({3-trifluoromethyl-4-[4-(3-trifluoromethyl-phenyl)-piperazin-1-yl]-phenylamino}-methyl)-phenoxy]-5-nitro-benzoic acid | CHEMBL349130
Type:
Small organic molecule
Emp. Form.:
C33H28F6N4O6
Mol. Mass.:
690.589
SMILES:
COc1cccc(CNc2ccc(N3CCN(CC3)c3cccc(c3)C(F)(F)F)c(c2)C(F)(F)F)c1Oc1ccc(cc1C(O)=O)[N+]([O-])=O
: