Target
C-C chemokine receptor type 5
Ligand
BDBM50141904
Substrate
Meas. Tech.
ChEBML_44691
IC50
0.200000±n/a nM
Citation
 Shu, MLoebach, JLParker, KAMills, SGChapman, KTShen, DMMalkowitz, LSpringer, MSGould, SLDeMartino, JASiciliano, SJSalvo, JDLyons, KPivnichny, JVKwei, GYCarella, ACarver, GHolmes, KSchleif, WADanzeisen, RHazuda, DKessler, JLineberger, JMiller, MDEmini, EA Antagonists of human CCR5 receptor containing 4-(pyrazolyl)piperidine side chains. Part 3: SAR studies on the benzylpyrazole segment. Bioorg Med Chem Lett 14:947-52 (2004)  
Target
Name:
C-C chemokine receptor type 5
Synonyms:
C-C CKR-5 CC-CKR-5 CCR5 CCR5_HUMAN CHEMR13 HIV-1 fusion coreceptor
Type:
Enzyme
Mol. Mass.:
40540.21
Organism:
Homo sapiens (Human)
Description:
P51681
Residue:
352
  
Inhibitor
Name:
BDBM50141904
Synonyms:
(R)-2-[(2S,3S)-3-[4-(2-Ethyl-5-naphthalen-2-ylmethyl-2H-pyrazol-3-yl)-piperidin-1-ylmethyl]-4-(3-fluoro-phenyl)-pyrrolidin-1-yl]-3,3-dimethyl-butyric acid | CHEMBL369235
Type:
Small organic molecule
Emp. Form.:
C38H47FN4O2
Mol. Mass.:
610.8038
SMILES:
CCn1nc(Cc2ccc3ccccc3c2)cc1C1CCN(C[C@H]2CN(C[C@@H]2c2cccc(F)c2)[C@@H](C(O)=O)C(C)(C)C)CC1
: