Target
Tyrosine-protein phosphatase non-receptor type 1
Ligand
BDBM13598
Substrate
Meas. Tech.
ChEBML_162582
IC50
38±n/a nM
Citation
 Lau, CKBayly, CIGauthier, JYLi, CSTherien, MAsante-Appiah, ECromlish, WBoie, YForghani, FDesmarais, SWang, QSkorey, KWaddleton, DPayette, PRamachandran, CKennedy, BPScapin, G Structure based design of a series of potent and selective non peptidic PTP-1B inhibitors. Bioorg Med Chem Lett 14:1043-8 (2004)  
Target
Name:
Tyrosine-protein phosphatase non-receptor type 1
Synonyms:
PTN1_HUMAN PTPN1 Protein tyrosine phosphatase-1B (PTP1B) Protein-tyrosine phosphatase 1B (PTP1B) Tyrosine-protein phosphatase non-receptor type 1 (PTP1B)
Type:
Protein phosphatase
Mol. Mass.:
49963.76
Organism:
Homo sapiens (Human)
Description:
Human recombinant GST-fusion PTP1B (1-435).
Residue:
435
  
Inhibitor
Name:
BDBM13598
Synonyms:
({4-[2-(1H-1,2,3-benzotriazol-1-yl)-2-phenyl-3-(4-phenylphenyl)propyl]phenyl}difluoromethyl)phosphonic acid CHEMBL267759
Type:
Small organic molecule
Emp. Form.:
C34H28F2N3O3P
Mol. Mass.:
595.575
SMILES:
OP(O)(=O)C(F)(F)c1ccc(CC(Cc2ccc(cc2)-c2ccccc2)(c2ccccc2)n2nnc3ccccc23)cc1
: