Target
Tyrosine-protein phosphatase non-receptor type 1
Ligand
BDBM13604
Substrate
Meas. Tech.
ChEMBL_162584 (CHEMBL768525)
IC50
5.00±n/a nM
Citation
 Lau, CKBayly, CIGauthier, JYLi, CSTherien, MAsante-Appiah, ECromlish, WBoie, YForghani, FDesmarais, SWang, QSkorey, KWaddleton, DPayette, PRamachandran, CKennedy, BPScapin, G Structure based design of a series of potent and selective non peptidic PTP-1B inhibitors. Bioorg Med Chem Lett 14:1043-8 (2004)  
Target
Name:
Tyrosine-protein phosphatase non-receptor type 1
Synonyms:
PTN1_HUMAN PTPN1 Protein tyrosine phosphatase-1B (PTP1B) Protein-tyrosine phosphatase 1B (PTP1B) Tyrosine-protein phosphatase non-receptor type 1 (PTP1B)
Type:
Protein phosphatase
Mol. Mass.:
49963.76
Organism:
Homo sapiens (Human)
Description:
Human recombinant GST-fusion PTP1B (1-435).
Residue:
435
  
Inhibitor
Name:
BDBM13604
Synonyms:
6-{4-[2-(1H-1,2,3-benzotriazol-1-yl)-3-{4-[difluoro(phosphono)methyl]phenyl}-2-phenylpropyl]phenyl}-2-(1-methoxy-3-methylbutyl)quinoline-8-phosphonic acid CHEMBL266753
Type:
Small organic molecule
Emp. Form.:
C43H42F2N4O7P2
Mol. Mass.:
826.7605
SMILES:
COC(CC(C)C)c1ccc2cc(cc(c2n1)P(O)(O)=O)-c1ccc(CC(Cc2ccc(cc2)C(F)(F)P(O)(O)=O)(c2ccccc2)n2nnc3ccccc23)cc1
: