Target
Follicle-stimulating hormone receptor
Ligand
BDBM50142660
Substrate
Meas. Tech.
ChEBML_69355
EC50
900±n/a nM
Citation
 Guo, TAdang, AEDong, GFitzpatrick, DGeng, PHo, KKJibilian, CHKultgen, SGLiu, RMcDonald, ESaionz, KWValenzano, KJvan Straten, NCXie, DWebb, ML Small molecule biaryl FSH receptor agonists. Part 2: Lead optimization via parallel synthesis. Bioorg Med Chem Lett 14:1717-20 (2004)  
Target
Name:
Follicle-stimulating hormone receptor
Synonyms:
FSH-R FSHR_HUMAN Follicle-stimulating hormone receptor LGR1
Type:
PROTEIN
Mol. Mass.:
78273.21
Organism:
Homo sapiens (Human)
Description:
ChEMBL_1351769
Residue:
695
  
Inhibitor
Name:
BDBM50142660
Synonyms:
(S)-4-Methyl-1-nonyl-3-(3',4',5'-trimethoxy-biphenyl-4-ylmethyl)-piperazine-2,5-dione | CHEMBL47838
Type:
Small organic molecule
Emp. Form.:
C30H42N2O5
Mol. Mass.:
510.6649
SMILES:
CCCCCCCCCN1CC(=O)N(C)[C@@H](Cc2ccc(cc2)-c2cc(OC)c(OC)c(OC)c2)C1=O
: