Target
Voltage-dependent calcium channel subunit alpha-2/delta-1
Ligand
BDBM50143359
Substrate
Meas. Tech.
ChEBML_32526
IC50
760±n/a nM
Citation
 Lim, JStock, NPracitto, RBoueres, JKMunoz, BChaudhary, ASantini, AMOrr, KSchaffhauser, HBezverkov, REAiyar, JVenkatraman, S N-Acridin-9-yl-butane-1,4-diamine derivatives: high-affinity ligands of the alpha2delta subunit of voltage gated calcium channels. Bioorg Med Chem Lett 14:1913-6 (2004)  
Target
Name:
Voltage-dependent calcium channel subunit alpha-2/delta-1
Synonyms:
CA2D1_HUMAN CACNL2A MHS3 Voltage-dependent calcium channel subunit delta-1 Voltage-gated calcium channel alpha2/delta subunit 1 | Voltage-gated calcium channel subunit alpha-2/delta-1
Type:
Enzyme
Mol. Mass.:
124544.88
Organism:
Homo sapiens (Human)
Description:
P54289
Residue:
1103
  
Inhibitor
Name:
BDBM50143359
Synonyms:
(R)-N*1*,N*1*-Diethyl-N*4*-(1,2,3,4,5,6,7,8-octahydro-acridin-9-yl)-pentane-1,4-diamine | CHEMBL300325
Type:
Small organic molecule
Emp. Form.:
C22H37N3
Mol. Mass.:
343.5493
SMILES:
CCN(CC)CCC[C@@H](C)Nc1c2CCCCc2nc2CCCCc12
: