Target
5-hydroxytryptamine receptor 2A
Ligand
BDBM50144835
Substrate
Meas. Tech.
ChEMBL_2292 (CHEMBL617077)
Ki
171±n/a nM
Citation
 Bentley, JMAdams, DRBebbington, DBenwell, KRBickerdike, MJDavidson, JEDawson, CEDourish, CTDuncton, MAGaur, SGeorge, ARGiles, PRHamlyn, RJKennett, GAKnight, ARMalcolm, CSMansell, HLMisra, AMonck, NJPratt, RMQuirk, KRoffey, JRVickers, SPCliffe, IA Indoline derivatives as 5-HT(2C) receptor agonists. Bioorg Med Chem Lett 14:2367-70 (2004)  
Target
Name:
5-hydroxytryptamine receptor 2A
Synonyms:
5-HT-2 5-HT2A 5-hydroxytryptamine receptor 2A (5HT-2A) 5HT2A_HUMAN HTR2A | Serotonin receptor 2A
Type:
undefined
Mol. Mass.:
52607.65
Organism:
Homo sapiens (Human)
Description:
P28223
Residue:
471
  
Inhibitor
Name:
BDBM50144835
Synonyms:
(S)-1-Methyl-2-(6-methylsulfanyl-2,3-dihydro-indol-1-yl)-ethylamine | CHEMBL451543
Type:
Small organic molecule
Emp. Form.:
C12H18N2S
Mol. Mass.:
222.35
SMILES:
CSc1ccc2CCN(C[C@H](C)N)c2c1
: