Target
Genome polyprotein
Ligand
BDBM50145842
Substrate
Meas. Tech.
ChEMBL_143475 (CHEMBL751815)
Kd
>600±n/a nM
Citation
 Wyss, DFArasappan, ASenior, MMWang, YSBeyer, BMNjoroge, FGMcCoy, MA Non-peptidic small-molecule inhibitors of the single-chain hepatitis C virus NS3 protease/NS4A cofactor complex discovered by structure-based NMR screening. J Med Chem 47:2486-98 (2004)  
Target
Name:
Genome polyprotein
Synonyms:
Hepatitis C virus NS3 protease/helicase | Hepatitis C virus serine protease, NS3/NS4A
Type:
Protein
Mol. Mass.:
67067.41
Organism:
Hepatitis C virus
Description:
A3EZI9
Residue:
631
  
Inhibitor
Name:
BDBM50145842
Synonyms:
5-Bromo-2-(4-hydroxy-benzoyl)-benzoic acid | CHEMBL84813
Type:
Small organic molecule
Emp. Form.:
C14H9BrO4
Mol. Mass.:
321.123
SMILES:
OC(=O)c1cc(Br)ccc1C(=O)c1ccc(O)cc1
: