Target
NAD-dependent histone deacetylase SIR2
Ligand
BDBM50146044
Substrate
Meas. Tech.
ChEBML_202251
IC50
27000±n/a nM
Citation
 Posakony, JHirao, MStevens, SSimon, JABedalov, A Inhibitors of Sir2: evaluation of splitomicin analogues. J Med Chem 47:2635-44 (2004)  
Target
Name:
NAD-dependent histone deacetylase SIR2
Synonyms:
MAR1 SIR2_YEAST
Type:
PROTEIN
Mol. Mass.:
63277.80
Organism:
Saccharomyces cerevisiae
Description:
ChEMBL_942450
Residue:
562
  
Inhibitor
Name:
BDBM50146044
Synonyms:
2-Allyl-1,2-dihydro-benzo[f]chromen-3-one | CHEMBL91134
Type:
Small organic molecule
Emp. Form.:
C16H14O2
Mol. Mass.:
238.2812
SMILES:
C=CCC1Cc2c(OC1=O)ccc1ccccc21
: