Target
Hormone-sensitive lipase
Ligand
BDBM50147286
Substrate
Meas. Tech.
ChEMBL_517 (CHEMBL615539)
IC50
170±n/a nM
Citation
 Lowe, DBMagnuson, SQi, NCampbell, AMCook, JHong, ZWang, MRodriguez, MAchebe, FKluender, HWong, WCBullock, WHSalhanick, AIWitman-Jones, TBowling, MEKeiper, CClairmont, KB In vitro SAR of (5-(2H)-isoxazolonyl) ureas, potent inhibitors of hormone-sensitive lipase. Bioorg Med Chem Lett 14:3155-9 (2004)  
Target
Name:
Hormone-sensitive lipase
Synonyms:
HSL Hormone-sensitive lipase (HSL) LIPS_HUMAN
Type:
Protein
Mol. Mass.:
116599.07
Organism:
Homo sapiens (Human)
Description:
Q05469
Residue:
1076
  
Inhibitor
Name:
BDBM50147286
Synonyms:
1-(4-Isopropyl-3-methyl-5-oxo-5H-isoxazole-2-carbonyl)-piperidine-3-carboxylic acid ethyl ester ethyl 1-(4-isopropyl-3-methyl-5-oxo-2,5-dihydroisoxazole-2-carbonyl)piperidine-3-carboxylate
Type:
Small organic molecule
Emp. Form.:
C16H24N2O5
Mol. Mass.:
324.3722
SMILES:
CCOC(=O)C1CCCN(C1)C(=O)n1oc(=O)c(C(C)C)c1C
: