Target
Hormone-sensitive lipase
Ligand
BDBM50147259
Substrate
Meas. Tech.
ChEBML_88045
IC50
24±n/a nM
Citation
 Lowe, DBMagnuson, SQi, NCampbell, AMCook, JHong, ZWang, MRodriguez, MAchebe, FKluender, HWong, WCBullock, WHSalhanick, AIWitman-Jones, TBowling, MEKeiper, CClairmont, KB In vitro SAR of (5-(2H)-isoxazolonyl) ureas, potent inhibitors of hormone-sensitive lipase. Bioorg Med Chem Lett 14:3155-9 (2004)  
Target
Name:
Hormone-sensitive lipase
Synonyms:
HSL Hormone-sensitive lipase (HSL) LIPS_HUMAN
Type:
Protein
Mol. Mass.:
116599.07
Organism:
Homo sapiens (Human)
Description:
Q05469
Residue:
1076
  
Inhibitor
Name:
BDBM50147259
Synonyms:
4-Cyclopentyl-3-methyl-2-(4-phenyl-piperidine-1-carbonyl)-2H-isoxazol-5-one CHEMBL320708
Type:
Small organic molecule
Emp. Form.:
C21H26N2O3
Mol. Mass.:
354.4427
SMILES:
Cc1c(C2CCCC2)c(=O)on1C(=O)N1CCC(CC1)c1ccccc1
: