Target
Hormone-sensitive lipase
Ligand
BDBM50147293
Substrate
Meas. Tech.
ChEBML_88045
IC50
71±n/a nM
Citation
 Lowe, DBMagnuson, SQi, NCampbell, AMCook, JHong, ZWang, MRodriguez, MAchebe, FKluender, HWong, WCBullock, WHSalhanick, AIWitman-Jones, TBowling, MEKeiper, CClairmont, KB In vitro SAR of (5-(2H)-isoxazolonyl) ureas, potent inhibitors of hormone-sensitive lipase. Bioorg Med Chem Lett 14:3155-9 (2004)  
Target
Name:
Hormone-sensitive lipase
Synonyms:
HSL Hormone-sensitive lipase (HSL) LIPS_HUMAN
Type:
Protein
Mol. Mass.:
116599.07
Organism:
Homo sapiens (Human)
Description:
Q05469
Residue:
1076
  
Inhibitor
Name:
BDBM50147293
Synonyms:
3-Methyl-2-(piperidine-1-carbonyl)-4-(tetrahydro-pyran-4-yl)-2H-isoxazol-5-one CHEMBL106503
Type:
Small organic molecule
Emp. Form.:
C15H22N2O4
Mol. Mass.:
294.3462
SMILES:
Cc1c(C2CCOCC2)c(=O)on1C(=O)N1CCCCC1
: