Target
Kappa-type opioid receptor
Ligand
BDBM50148078
Substrate
Meas. Tech.
ChEMBL_145819 (CHEMBL753530)
Ki
359000±n/a nM
Citation
 Spetea, MSchüllner, FMoisa, RCBerzetei-Gurske, IPSchraml, BDörfler, CAceto, MDHarris, LSCoop, ASchmidhammer, H Synthesis and biological evaluation of 14-alkoxymorphinans. 21. Novel 4-alkoxy and 14-phenylpropoxy derivatives of the mu opioid receptor antagonist cyprodime. J Med Chem 47:3242-7 (2004)  
Target
Name:
Kappa-type opioid receptor
Synonyms:
KOR-1 OPIATE Kappa Opioid receptor Ror-d
Type:
G Protein-Coupled Receptor (GPCR)
Mol. Mass.:
42692.90
Organism:
Rattus norvegicus (rat)
Description:
P34975
Residue:
380
  
Inhibitor
Name:
BDBM50148078
Synonyms:
17-cyclopropylmethyl-10-methoxy-13-oxo-(1R,9R,10S)-17-azatetracyclo[7.5.3.01,10.02,7]heptadeca-2(7),3,5-trien-3-yl 3-phenyl-(E)-2-propenoate | CHEMBL109786
Type:
Small organic molecule
Emp. Form.:
C30H33NO4
Mol. Mass.:
471.5873
SMILES:
CO[C@@]12CCC(=O)CC11CCN(CC3CC3)[C@@H]2Cc2cccc(OC(=O)\C=C\c3ccccc3)c12
: