Target
Lysophosphatidic acid receptor 2
Ligand
BDBM50148423
Substrate
Meas. Tech.
ChEBML_201449
IC50
33±n/a nM
Citation
 Hale, JJDoherty, GToth, LMills, SGHajdu, RKeohane, CARosenbach, MMilligan, JShei, GJChrebet, GBergstrom, JCard, DForrest, MSun, SYWest, SXie, HNomura, NRosen, HMandala, S Selecting against S1P3 enhances the acute cardiovascular tolerability of 3-(N-benzyl)aminopropylphosphonic acid S1P receptor agonists. Bioorg Med Chem Lett 14:3501-5 (2004)  
Target
Name:
Lysophosphatidic acid receptor 2
Synonyms:
EDG4 LPA-2 LPAR2 Lysophosphatidic acid receptor 2 | Lysophosphatidic acid receptor Edg-4
Type:
PROTEIN
Mol. Mass.:
39103.44
Organism:
Homo sapiens (Human)
Description:
ChEMBL_1451385
Residue:
351
  
Inhibitor
Name:
BDBM50148423
Synonyms:
CHEMBL118783 | [3-(3-Bromo-4-heptyloxy-5-methoxy-benzylamino)-propyl]-phosphonic acid
Type:
Small organic molecule
Emp. Form.:
C18H31BrNO5P
Mol. Mass.:
452.32
SMILES:
CCCCCCCOc1c(Br)cc(CNCCCP(O)(O)=O)cc1OC
: