Target
Diacylglycerol acyltransferase/mycolyltransferase Ag85C
Ligand
BDBM50148595
Substrate
Meas. Tech.
ChEBML_35860
IC50
471310±n/a nM
Citation
 Gobec, SPlantan, IMravljak, JWilson, RABesra, GSKikelj, D Phosphonate inhibitors of antigen 85C, a crucial enzyme involved in the biosynthesis of the Mycobacterium tuberculosis cell wall. Bioorg Med Chem Lett 14:3559-62 (2004)  
Target
Name:
Diacylglycerol acyltransferase/mycolyltransferase Ag85C
Synonyms:
A85C_MYCTU fbpC | mpt45
Type:
PROTEIN
Mol. Mass.:
36770.32
Organism:
Mycobacterium tuberculosis
Description:
ChEMBL_431881
Residue:
340
  
Inhibitor
Name:
BDBM50148595
Synonyms:
CHEMBL119480 ethyl hydrogen nonylphosphonate
Type:
Small organic molecule
Emp. Form.:
C11H25O3P
Mol. Mass.:
236.2882
SMILES:
CCCCCCCCCP(O)(=O)OCC
: