Target
Sodium-dependent serotonin transporter
Ligand
BDBM50153627
Substrate
Meas. Tech.
ChEMBL_302824 (CHEMBL839613)
Ki
0.5±n/a nM
Citation
 Gilbert, AMColeman, TKodah, JMewshaw, REScerni, RSchechter, LESmith, DLAndree, TH Novel aryloxy-8-azabicyclo[3.2.1]oct-3-enes with 5-HT transporter and 5-HT1A affinity. Bioorg Med Chem Lett 14:5281-4 (2004)  
Target
Name:
Sodium-dependent serotonin transporter
Synonyms:
5-HT Transporter 5HT transporter Anandamid membrane transporter, AMT Monoamine transporters; Norepinephrine & serotonin Slc6a4 Sodium-dependent serotonin transporter (SERT) | imipramine receptor
Type:
Multi-pass membrane protein
Mol. Mass.:
70168.43
Organism:
Rattus norvegicus (rat)
Description:
P31652
Residue:
630
  
Inhibitor
Name:
BDBM50153627
Synonyms:
8-[2-(3-Naphthalen-2-yl-8-aza-bicyclo[3.2.1]oct-2-en-8-yl)-ethoxy]-quinoline | CHEMBL187745
Type:
Small organic molecule
Emp. Form.:
C28H26N2O
Mol. Mass.:
406.5188
SMILES:
C(CN1C2CCC1C=C(C2)c1ccc2ccccc2c1)Oc1cccc2cccnc12
: