Target
Plasminogen
Ligand
BDBM50138670
Substrate
Meas. Tech.
ChEMBL_302472 (CHEMBL826337)
Ki
1950±n/a nM
Citation
 Bruncko, MMcClellan, WJWendt, MDSauer, DRGeyer, ADalton, CRKaminski, MAWeitzberg, MGong, JDellaria, JFMantei, RZhao, XNienaber, VLStewart, KKlinghofer, VBouska, JRockway, TWGiranda, VL Naphthamidine urokinase plasminogen activator inhibitors with improved pharmacokinetic properties. Bioorg Med Chem Lett 15:93-8 (2004)  
Target
Name:
Plasminogen
Synonyms:
Activation peptide PLG Plasmin Plasmin heavy chain A, short form | Plasmin light chain B
Type:
Enzyme
Mol. Mass.:
90579.18
Organism:
Homo sapiens (Human)
Description:
Residue:
810
  
Inhibitor
Name:
BDBM50138670
Synonyms:
6-Carbamimidoyl-naphthalene-2-carboxylic acid phenylamide 6-carbamimidoyl-N-phenyl-2-naphthamide uPa_7
Type:
Small organic molecule
Emp. Form.:
C18H15N3O
Mol. Mass.:
289.3312
SMILES:
NC(=N)c1ccc2cc(ccc2c1)C(=O)Nc1ccccc1
: