Target
Peroxisome proliferator-activated receptor gamma
Ligand
BDBM50157930
Substrate
Meas. Tech.
ChEMBL_305707 (CHEMBL827222)
IC50
84.0±n/a nM
Citation
 Acton, JJBlack, RMJones, ABMoller, DEColwell, LDoebber, TWMacnaul, KLBerger, JWood, HB Benzoyl 2-methyl indoles as selective PPARgamma modulators. Bioorg Med Chem Lett 15:357-62 (2004)  
Target
Name:
Peroxisome proliferator-activated receptor gamma
Synonyms:
NR1C3 PPAR-gamma PPARG_HUMAN Peroxisome proliferator-activated receptor gamma (PPAR gamma) Peroxisome proliferator-activated receptor gamma (PPARĪ³) peroxisome proliferator-activated receptor gamma isoform 2
Type:
Nuclear Receptor
Mol. Mass.:
57613.46
Organism:
Homo sapiens (Human)
Description:
P37231
Residue:
505
  
Inhibitor
Name:
BDBM50157930
Synonyms:
2-{2-[1-(4-Chloro-benzoyl)-5-methoxy-2-methyl-1H-indol-3-ylmethyl]-phenoxy}-propionic acid | CHEMBL367360
Type:
Small organic molecule
Emp. Form.:
C27H24ClNO5
Mol. Mass.:
477.936
SMILES:
COc1ccc2n(C(=O)c3ccc(Cl)cc3)c(C)c(Cc3ccccc3OC(C)C(O)=O)c2c1
: