Target
DNA polymerase III subunit alpha
Ligand
BDBM50160353
Substrate
Meas. Tech.
ChEMBL_302895 (CHEMBL830211)
Ki
51000±n/a nM
Citation
 Wright, GEBrown, NCXu, WCLong, ZYZhi, CGambino, JJBarnes, MHButler, MM Active site directed inhibitors of replication-specific bacterial DNA polymerases. Bioorg Med Chem Lett 15:729-32 (2005)  
Target
Name:
DNA polymerase III subunit alpha
Synonyms:
DNA polymerase III dnaE DNA polymerase IIIE dnaE | polC
Type:
Enzyme
Mol. Mass.:
129872.84
Organism:
Escherichia coli
Description:
Enzyme was purified from recombinant strains.
Residue:
1160
  
Inhibitor
Name:
BDBM50160353
Synonyms:
2-(3,4-Dichloro-benzylamino)-7-(5-methanesulfonyl-pentyl)-1,7-dihydro-purin-6-one | CHEMBL180494
Type:
Small organic molecule
Emp. Form.:
C18H21Cl2N5O3S
Mol. Mass.:
458.362
SMILES:
CS(=O)(=O)CCCCCn1cnc2nc(NCc3ccc(Cl)c(Cl)c3)[nH]c(=O)c12
: