Target
Collagenase 3
Ligand
BDBM50160856
Substrate
Meas. Tech.
ChEMBL_302508 (CHEMBL828223)
Ki
54±n/a nM
Citation
 Kim, SHPudzianowski, ATLeavitt, KJBarbosa, JMcDonnell, PAMetzler, WJRankin, BMLiu, RVaccaro, WPitts, W Structure-based design of potent and selective inhibitors of collagenase-3 (MMP-13). Bioorg Med Chem Lett 15:1101-6 (2005)  
Target
Name:
Collagenase 3
Synonyms:
MMP-13 MMP13_HUMAN Matrix metalloproteinase-13 (MMP-13) | Matrix metalloproteinase-13 (MMP13)
Type:
Enzyme
Mol. Mass.:
53808.06
Organism:
Homo sapiens (Human)
Description:
P45452
Residue:
471
  
Inhibitor
Name:
BDBM50160856
Synonyms:
1-[4-(3-Chloro-phenoxy)-phenyl]-1,7,9-triaza-spiro[4.5]decane-2,6,8,10-tetraone | CHEMBL425341
Type:
Small organic molecule
Emp. Form.:
C19H14ClN3O5
Mol. Mass.:
399.785
SMILES:
Clc1cccc(Oc2ccc(cc2)N2C(=O)CCC22C(=O)NC(=O)NC2=O)c1
: