Target
Protein kinase C delta type
Ligand
BDBM50162990
Substrate
Meas. Tech.
ChEMBL_305430 (CHEMBL830923)
IC50
31±n/a nM
Citation
 Zhang, HCDerian, CKMcComsey, DFWhite, KBYe, HHecker, LRLi, JAddo, MFCroll, DEckardt, AJSmith, CELi, QCheung, WMConway, BREmanuel, SDemarest, KTAndrade-Gordon, PDamiano, BPMaryanoff, BE Novel indolylindazolylmaleimides as inhibitors of protein kinase C-beta: synthesis, biological activity, and cardiovascular safety. J Med Chem 48:1725-8 (2005)  
Target
Name:
Protein kinase C delta type
Synonyms:
KPCD_HUMAN PKCD Protein Kinase C- delta nPKC-delta
Type:
Enzyme
Mol. Mass.:
77516.79
Organism:
Homo sapiens (Human)
Description:
The recombinant human PKC enzymes were produced using a baculovirus expression system in SF9 cells
Residue:
676
  
Inhibitor
Name:
BDBM50162990
Synonyms:
3-[1-(3-Dimethylamino-propyl)-1H-indazol-3-yl]-4-(1-quinolin-3-yl-1H-indol-3-yl)-pyrrole-2,5-dione | CHEMBL359486
Type:
Small organic molecule
Emp. Form.:
C33H28N6O2
Mol. Mass.:
540.6144
SMILES:
CN(C)CCCn1nc(C2=C(C(=O)NC2=O)c2cn(-c3cnc4ccccc4c3)c3ccccc23)c2ccccc12
: