Target
D(3) dopamine receptor
Ligand
BDBM50105731
Substrate
Meas. Tech.
ChEMBL_304378 (CHEMBL829020)
EC50
1.1±n/a nM
Citation
 Boeckler, FOhnmacht, ULehmann, TUtz, WHübner, HGmeiner, P CoMFA and CoMSIA investigations revealing novel insights into the binding modes of dopamine D3 receptor agonists. J Med Chem 48:2493-508 (2005)  
Target
Name:
D(3) dopamine receptor
Synonyms:
DOPAMINE D3 DRD3_HUMAN Dopamine D3 receptor (D3) Dopamine receptor Dopamine receptor D3
Type:
Mol. Mass.:
44243.43
Organism:
Homo sapiens (Human)
Description:
Residue:
400
  
Inhibitor
Name:
BDBM50105731
Synonyms:
(S)-7-Dipropylamino-5,6,7,8-tetrahydro-indolizine-3-carbaldehyde | CHEMBL316983
Type:
Small organic molecule
Emp. Form.:
C15H24N2O
Mol. Mass.:
248.3639
SMILES:
CCCN(CCC)[C@H]1CCn2c(C1)ccc2C=O
: