Target
5-hydroxytryptamine receptor 4
Ligand
BDBM34142
Substrate
Meas. Tech.
ChEMBL_321356 (CHEMBL881500)
IC50
44±n/a nM
Citation
 Mattsson, CSonesson, CSandahl, AGreiner, HEGassen, MPlaschke, JLeibrock, JBöttcher, H 2-Alkyl-3-(1,2,3,6-tetrahydropyridin-4-yl)-1H-indoles as novel 5-HT6 receptor agonists. Bioorg Med Chem Lett 15:4230-4 (2005)  
Target
Name:
5-hydroxytryptamine receptor 4
Synonyms:
5-HT4 5HT4R_CAVPO Serotonin 4 (5-HT4) receptor
Type:
Enzyme Catalytic Domain
Mol. Mass.:
43735.29
Organism:
GUINEA PIG
Description:
5-HT4 HTR4 GUINEA PIG::O70528
Residue:
388
  
Inhibitor
Name:
BDBM34142
Synonyms:
2-ethyl-5-methoxy-N,N-dimethyltryptamine EDMT [2-(2-ethyl-5-methoxy-1H-indol-3-yl)ethyl]dimethylamine, 6
Type:
Small organic molecule
Emp. Form.:
C15H22N2O
Mol. Mass.:
246.348
SMILES:
CCc1[nH]c2ccc(OC)cc2c1CCN(C)C
: