Target
Dipeptidyl peptidase 4
Ligand
BDBM50171552
Substrate
Meas. Tech.
ChEMBL_321386 (CHEMBL881764)
IC50
0.300000±n/a nM
Citation
 Shreder, KRWong, MSCorral, SYu, ZWinn, DTWu, MHu, YNomanbhoy, TAlemayehu, SFuller, SRRosenblum, JSKozarich, JW Boro-norleucine as a P1 residue for the design of selective and potent DPP7 inhibitors. Bioorg Med Chem Lett 15:4256-60 (2005)  
Target
Name:
Dipeptidyl peptidase 4
Synonyms:
ADABP Adenosine deaminase complexing protein 2 CD_antigen=CD26 DPP4 DPPIV Dipeptidyl peptidase 4 (DPP IV) Dipeptidyl peptidase 4 (DPP4) Dipeptidyl peptidase 4 membrane form Dipeptidyl peptidase IV Dipeptidyl peptidase IV (DDP-IV) Dipeptidyl peptidase IV membrane form Dipeptidyl peptidase-IV (DPP-4) T-cell activation antigen CD26 | TP103
Type:
Enzyme
Mol. Mass.:
88271.01
Organism:
Homo sapiens (Human)
Description:
P27487
Residue:
766
  
Inhibitor
Name:
BDBM50171552
Synonyms:
(S)-2-(S)-Amino-1-(2-boron-dihydroxide-pyrrolidine)-3-methyl-butan-1-one | CHEMBL195189
Type:
Small organic molecule
Emp. Form.:
C9H19BN2O3
Mol. Mass.:
214.07
SMILES:
CC(C)[C@H](N)C(=O)N1CCC[C@@H]1B(O)O
: