Target
Serine/threonine-protein kinase PAK 4
Ligand
BDBM50175252
Substrate
Meas. Tech.
ChEMBL_328338 (CHEMBL864553)
IC50
>100000±n/a nM
Citation
 Akritopoulou-Zanze, IDarczak, DSarris, KPhelan, KMHuth, JRSong, DJohnson, EFJia, YDjuric, SW Scaffold oriented synthesis. Part 1: Design, preparation, and biological evaluation of thienopyrazoles as kinase inhibitors. Bioorg Med Chem Lett 16:96-9 (2005)  
Target
Name:
Serine/threonine-protein kinase PAK 4
Synonyms:
KIAA1142 PAK4_HUMAN | p21-Activated kinase 4 (PAK4)
Type:
Protein
Mol. Mass.:
64098.01
Organism:
Homo sapiens (Human)
Description:
O96013
Residue:
591
  
Inhibitor
Name:
BDBM50175252
Synonyms:
3-methyl-4-(2-phenoxyacetamido)-1H-thieno[2,3-c]pyrazole-5-carboxamide | CHEMBL199759
Type:
Small organic molecule
Emp. Form.:
C15H14N4O3S
Mol. Mass.:
330.362
SMILES:
Cc1[nH]nc2sc(C(N)=O)c(NC(=O)COc3ccccc3)c12
: