Target
Histamine H3 receptor
Ligand
BDBM50177532
Substrate
Meas. Tech.
ChEMBL_334179 (CHEMBL866473)
Ki
6±n/a nM
Citation
 Berlin, MTing, PCVaccaro, WDAslanian, RMcCormick, KDLee, JFAlbanese, MMMutahi, MWPiwinski, JJShih, NYDuguma, LSolomon, DMZhou, WSher, RFavreau, LBryant, MKorfmacher, WANardo, CWest, REAnthes, JCWilliams, SMWu, RLSusan She, HRivelli, MACorboz, MRHey, JA Reduction of CYP450 inhibition in the 4-[(1H-imidazol-4-yl)methyl]piperidine series of histamine H3 receptor antagonists. Bioorg Med Chem Lett 16:989-94 (2006)  
Target
Name:
Histamine H3 receptor
Synonyms:
HISTAMINE H3 HRH3_CAVPO | Histamine H3 receptor
Type:
Enzyme Catalytic Domain
Mol. Mass.:
48753.61
Organism:
GUINEA PIG
Description:
HISTAMINE H3 HRH3 GUINEA PIG::Q9JI35
Residue:
445
  
Inhibitor
Name:
BDBM50177532
Synonyms:
4-((1H-imidazol-4-yl)methyl)-1-(3-(4-(cyclohexyloxy)phenoxy)propyl)piperidine | CHEMBL204606
Type:
Small organic molecule
Emp. Form.:
C24H35N3O2
Mol. Mass.:
397.5536
SMILES:
C(COc1ccc(OC2CCCCC2)cc1)CN1CCC(Cc2cnc[nH]2)CC1
: